{"text_format":"1","workbook":"xlsx","n_sheets":5,"sheets":["Main","Spreadsheet","Dashboard Data","Settings","Dashboard"],"not_rendered":{"charts":10,"images":3,"macros":1,"external_links":1,"defined_names":55,"comments":0,"pivot_tables":0},"unopened":[],"bounds":{"document_bytes":16777216,"sheet_cells":100000,"rows_first":2000,"rows_last":500,"rows_between":2000,"halvings":0,"cell_chars":16384,"cell_head_chars":4096},"cells_cut":0,"cells_raw":0,"read":"whole","date_system":"1900"}

{"sheet":"Main","index":0,"n_rows":0,"n_cols":0,"rows_kept":0,"cut":false,"hidden":false,"merged":[]}

{"sheet":"Spreadsheet","index":1,"n_rows":533,"n_cols":24,"rows_kept":533,"cut":false,"hidden":false,"merged":[[115,7,123,7],[152,7,154,7],[306,7,309,7],[102,7,105,7],[250,7,252,7],[277,7,282,7],[287,7,290,7],[253,7,268,7],[269,7,276,7],[436,7,438,7],[440,7,442,7],[373,7,377,7],[378,7,379,7],[380,7,382,7],[367,7,371,7],[362,7,364,7],[335,7,336,7],[337,7,338,7],[109,7,111,7],[192,7,194,7],[244,7,249,7],[310,7,317,7],[354,7,361,7],[215,7,217,7],[296,7,301,7],[294,7,295,7],[195,7,205,7],[318,7,322,7],[323,7,324,7],[227,7,243,7],[82,7,84,7],[85,7,88,7],[89,7,93,7],[94,7,95,7],[98,7,101,7],[66,7,71,7],[74,7,79,7],[80,7,81,7],[50,7,52,7],[55,7,57,7],[16,7,17,7],[19,7,23,7],[42,7,46,7],[47,7,49,7],[27,7,28,7],[24,7,26,7],[29,7,41,7],[488,7,491,7],[383,7,386,7],[387,7,393,7],[483,7,486,7],[395,7,397,7],[402,7,404,7],[405,7,407,7],[408,7,413,7],[415,7,420,7],[421,7,427,7],[428,7,431,7],[432,7,435,7],[452,7,457,7],[469,7,470,7],[461,7,464,7],[458,7,460,7]]}
[null,null,null,null,null,null,null,null,"`","IGOM Gap Analysis spreadsheet"]
[]
[null,null,null,null,null,null,null,null,null,null,null,null,null,null,null,null,null,null,null,null,null,null,null,"Not in scope"]
[null,null,null,null,null,null,null,null,null,null,null,null,null,null,null,null,null,null,null,null,null,null,null,"Conformity"]
[null,null,null,null,null,null,null,null,null,null,null,null,null,null,null,null,null,null,null,null,null,null,null,"Variation"]
[]
[]
[]
[]
[]
[]
[]
[]
[null,null,null,null,null,null,null,null,null,"Airline GOM Provision","Gap Analysis Airline GOM Vs IGOM","Actions/Notes"]
[null,null,null,null,null,null,null,"Chapter 1: Passenger Handling Procedures"]
[null,null,null,null,null,null,null,"1.1 Passenger Departure"]
[null,null,null,null,null,null,null,"1.1.1 Pre-Departure Activities","1.1.1.1 Ticket Sales Counter"]
[null,null,null,null,null,null,null,null,"1.1.1.2 Passenger Pre-Flight Preparation"]
[null,null,null,null,null,null,null,"1.1.2 Check-In Counter Requirements"]
[null,null,null,null,null,null,null,"1.1.3 Passenger Check-In","1.1.3.1 General"]
[null,null,null,null,null,null,null,null,"1.1.3.2 Check-In Deadlines"]
[null,null,null,null,null,null,null,null,"1.1.3.3 Operating Carrier, Marketing Carrier and Wet Lease"]
[null,null,null,null,null,null,null,null,"1.1.3.4 Check-In Types"]
[null,null,null,null,null,null,null,null,"1.1.3.5 Check-In Counter Opening"]
[null,null,null,null,null,null,null,"1.1.4 Passenger Acceptance","1.1.4.1 Requirements for Passenger Acceptance "]
[null,null,null,null,null,null,null,null,"1.1.4.2 Seating"]
[null,null,null,null,null,null,null,null,"1.1.4.3 Exit Row Seating"]
[null,null,null,null,null,null,null,"1.1.5 Travel Documents and Verification","1.1.5.1 General"]
[null,null,null,null,null,null,null,null,"1.1.5.2 Advance Passenger Information"]
[null,null,null,null,null,null,null,"1.1.6 Baggage Acceptance","1.1.6.1 General"]
[null,null,null,null,null,null,null,null,"1.1.6.2 Cabin Baggage"]
[null,null,null,null,null,null,null,null,"1.1.6.3 Checked Baggage"]
[null,null,null,null,null,null,null,null,"1.1.6.4 Dangerous Goods in Baggage"]
[null,null,null,null,null,null,null,null,"1.1.6.5 Baggage Pooling"]
[null,null,null,null,null,null,null,null,"1.1.6.6 Bulky and Oversized Baggage"]
[null,null,null,null,null,null,null,null,"1.1.6.7 Checked Baggage Allowances"]
[null,null,null,null,null,null,null,null,"1.1.6.8 Excess Baggage"]
[null,null,null,null,null,null,null,null,"1.1.6.9 Baggage Tagging"]
[null,null,null,null,null,null,null,null,"1.1.6.10 Types of Baggage Tags"]
[null,null,null,null,null,null,null,null,"1.1.6.11 Checked Baggage Destination"]
{"$rows_left_out":494}
{"sheet":"Dashboard Data","index":2,"n_rows":50,"n_cols":50,"rows_kept":50,"cut":false,"hidden":true,"merged":[[36,16,36,19],[39,23,39,26],[1,42,1,46],[1,1,1,4],[1,10,1,13],[1,16,1,21],[1,23,1,28],[1,30,1,33],[1,36,1,39]]}
[]
[null,"1. Passenger Handling Procedures",null,null,null,null,null,null,null,null,"2. Baggage Handling Procedures",null,null,null,null,null,"3. Aircraft General Safety/ Servicing Operations",null,null,null,null,null,null,"4. Aircraft Handling Procedures",null,null,null,null,null,null,"5. Load Control",null,null,null,null,null,"6. Airside Supervision and Safety",null,null,null,null,null,"7. Aircraft Cleaning",null,null,null,null,null,null,"Drop Down List"]
[null,"Passenger Handling Procedures","Conformity","Not in scope","Variation",null,null,null,null,null,"Baggage Handling Procedures","Conformity","Not in scope","Variation",null,null,"Cargo/Mail Handling Procedures","Conformity","Not in scope","Variation","Safety Critical Variation","Non Safety Critical Variation",null,"Aircraft Handling Procedures","Conformity","Not in scope","Variation","Safety Critical Variation","Non Safety Critical Variation",null,"Load Control","Conformity","Not in scope","Variation",null,null,"Airside Supervision and Safety","Conformity","Not in scope","Variation",null,null,"Aircraft Cleaning","Conformity","More Restrictive","Less Restrictive","Not Applicable",null,null,"Conformity"]
[null,"Departures",{"$f":"COUNTIF(Spreadsheet!$K$17:$K$53,C3)","v":0},{"$f":"COUNTIF(Spreadsheet!$K$17:$K$53,D3)","v":0},{"$f":"COUNTIF(Spreadsheet!$K$17:$K$53,E3)","v":0},null,null,null,null,null,"The Baggage Journey",{"$f":"COUNTIF(Spreadsheet!$K$128:$K$128,L3)","v":0},{"$f":"COUNTIF(Spreadsheet!$K$128:$K$128,M3)","v":0},{"$f":"COUNTIF(Spreadsheet!$K$128:$K$128,N3)","v":0},null,null,"Ramp Safety in Aircraft Handling",{"$f":"COUNTIF(Spreadsheet!$K$192:$K$206,R3)","v":0},{"$f":"COUNTIF(Spreadsheet!$K$192:$K$206,S3)","v":0},{"$f":"COUNTIF(Spreadsheet!$K$192:$K$206,T3)","v":0},{"$f":"COUNTIF(Settings!$C$4:$C$12,T3)","v":0},{"$f":"T4-U4","v":0},null,"Aircraft Arrival",{"$f":"COUNTIF(Spreadsheet!$K$335:$K$339,Y3)","v":0},{"$f":"COUNTIF(Spreadsheet!$K$335:$K$339,Z3)","v":0},{"$f":"COUNTIF(Spreadsheet!$K$335:$K$339,AA3)","v":0},{"$f":"COUNTIF(Settings!$C$93,$AA$3)","v":0},{"$f":"AA4-AB4","v":0},null,"Introduction",{"$f":"COUNTIF(Spreadsheet!$K$475,AF3)","v":0},{"$f":"COUNTIF(Spreadsheet!$K$475,AG3)","v":0},{"$f":"COUNTIF(Spreadsheet!$K$475,AH3)","v":0},null,null,"Introduction",{"$f":"COUNTIF(Spreadsheet!$K$510,AL3)","v":0},{"$f":"COUNTIF(Spreadsheet!$K$510,AM3)","v":0},{"$f":"COUNTIF(Spreadsheet!$K$510,AN3)","v":0},null,null,"Aircraft Cabin Appearance",null,null,null,null,null,null,"More Restrictive"]
[null,"Security",{"$f":"COUNTIF(Spreadsheet!$K$56:$K$61,C3)","v":0},{"$f":"COUNTIF(Spreadsheet!$K$56:$K$61,D3)","v":0},{"$f":"COUNTIF(Spreadsheet!$K$56:$K$61,E3)","v":0},null,null,null,null,null,"Baggage Activities",{"$f":"COUNTIF(Spreadsheet!$K$131:$K$132,L3)","v":0},{"$f":"COUNTIF(Spreadsheet!$K$131:$K$132,M3)","v":0},{"$f":"COUNTIF(Spreadsheet!$K$131:$K$132,N3)","v":0},null,null,"Safety During Fueling/Defueling",{"$f":"COUNTIF(Spreadsheet!$K$209:$K$211,R3)","v":0},{"$f":"COUNTIF(Spreadsheet!$K$209:$K$211,S3)","v":0},{"$f":"COUNTIF(Spreadsheet!$K$209:$K$211,T3)","v":0},0,{"$f":"T5-U5","v":0},null,"Aircraft Chocking",{"$f":"COUNTIF(Spreadsheet!$K$342:$K$344,Y3)","v":0},{"$f":"COUNTIF(Spreadsheet!$K$342:$K$344,Z3)","v":0},{"$f":"COUNTIF(Spreadsheet!$K$342:$K$344,AA3)","v":0},{"$f":"COUNTIF(Settings!$C$94,$AA$3)","v":0},{"$f":"AA5-AB5","v":0},null,"Load Control Principles",{"$f":"COUNTIF(Spreadsheet!$K$478,AF3)","v":0},{"$f":"COUNTIF(Spreadsheet!$K$478,AG3)","v":0},{"$f":"COUNTIF(Spreadsheet!$K$478,AH3)","v":0},null,null,"Operational Requirements",{"$f":"COUNTIF(Spreadsheet!$K$513,AL3)","v":0},{"$f":"COUNTIF(Spreadsheet!$K$513,AM3)","v":0},{"$f":"COUNTIF(Spreadsheet!$K$513,AN3)","v":0},null,null,null,null,null,null,null,null,null,"Less Restrictive"]
[null,"Movement",{"$f":"COUNTIF(Spreadsheet!$K$64:$K$72,C3)","v":0},{"$f":"COUNTIF(Spreadsheet!$K$64:$K$72,D3)","v":0},{"$f":"COUNTIF(Spreadsheet!$K$64:$K$72,E3)","v":0},null,null,null,null,null,"Safe Baggage Handling",{"$f":"COUNTIF(Spreadsheet!$K$135:$K$135,L3)","v":0},{"$f":"COUNTIF(Spreadsheet!$K$135:$K$135,M3)","v":0},{"$f":"COUNTIF(Spreadsheet!$K$135:$K$135,N3)","v":0},null,null,"Adverse Weather Conditions",{"$f":"COUNTIF(Spreadsheet!$K$214:$K$222,R3)","v":0},{"$f":"COUNTIF(Spreadsheet!$K$214:$K$222,S3)","v":0},{"$f":"COUNTIF(Spreadsheet!$K$214:$K$222,T3)","v":0},{"$f":"COUNTIF(Settings!C13,T3)","v":0},0,null,"Aircraft Coning",{"$f":"COUNTIF(Spreadsheet!$K$347:$K$351,Y3)","v":0},{"$f":"COUNTIF(Spreadsheet!$K$347:$K$351,Z3)","v":0},{"$f":"COUNTIF(Spreadsheet!$K$347:$K$351,AA3)","v":0},null,0,null,"Regulatory Requirements",{"$f":"COUNTIF(Spreadsheet!$K$481:$K$481,AF3)","v":0},{"$f":"COUNTIF(Spreadsheet!$K$481:$K$481,AG3)","v":0},{"$f":"COUNTIF(Spreadsheet!$K$481:$K$481,AH3)","v":0},null,null,"Supervision Scope",{"$f":"COUNTIF(Spreadsheet!$K$516,AL3)","v":0},{"$f":"COUNTIF(Spreadsheet!$K$516,AM3)","v":0},{"$f":"COUNTIF(Spreadsheet!$K$516,AN3)","v":0},null,null,null,null,null,null,null,null,null,"Not Applicable"]
[null,"Category",{"$f":"COUNTIF(Spreadsheet!$K$75:$K$106,C3)","v":0},{"$f":"COUNTIF(Spreadsheet!$K$75:$K$106,D3)","v":0},{"$f":"COUNTIF(Spreadsheet!$K$75:$K$106,E3)","v":0},null,null,null,null,null,"Departure Baggage Handling",{"$f":"COUNTIF(Spreadsheet!$K$138:$K$142,L3)","v":0},{"$f":"COUNTIF(Spreadsheet!$K$138:$K$142,M3)","v":0},{"$f":"COUNTIF(Spreadsheet!$K$138:$K$142,N3)","v":0},null,null,"Hand Signals",{"$f":"COUNTIF(Spreadsheet!$K$225:$K$283,R3)","v":0},{"$f":"COUNTIF(Spreadsheet!$K$225:$K$283,S3)","v":0},{"$f":"COUNTIF(Spreadsheet!$K$225:$K$283,T3)","v":0},{"$f":"COUNTIF(Settings!C14:C71,T3)","v":0},0,null,"Aircraft Doors",{"$f":"COUNTIF(Spreadsheet!$K$354:$K$365,Y3)","v":0},{"$f":"COUNTIF(Spreadsheet!$K$354:$K$365,Z3)","v":0},{"$f":"COUNTIF(Spreadsheet!$K$354:$K$365,AA3)","v":0},{"$f":"COUNTIF(Settings!$C$95:$C$105,$AA$3)","v":0},0,null,"Load Control Tasks",{"$f":"COUNTIF(Spreadsheet!$K$484:$K$493,AF3)","v":0},{"$f":"COUNTIF(Spreadsheet!$K$484:$K$493,AG3)","v":0},{"$f":"COUNTIF(Spreadsheet!$K$484:$K$493,AH3)","v":0},null,null,"Turnaround CoordinationSupervision Requirements",{"$f":"COUNTIF(Spreadsheet!$K$519,AL3)","v":0},{"$f":"COUNTIF(Spreadsheet!$K$519,AM3)","v":0},{"$f":"COUNTIF(Spreadsheet!$K$519,AN3)","v":0}]
[null,"Irregularities",{"$f":"COUNTIF(Spreadsheet!$K$109:$K$124,C3)","v":0},{"$f":"COUNTIF(Spreadsheet!$K$109:$K$124,D3)","v":0},{"$f":"COUNTIF(Spreadsheet!$K$109:$K$124,E3)","v":0},null,null,null,null,null,"Transfer Baggage",{"$f":"COUNTIF(Spreadsheet!$K$145:$K$148,L3)","v":0},{"$f":"COUNTIF(Spreadsheet!$K$145:$K$148,M3)","v":0},{"$f":"COUNTIF(Spreadsheet!$K$145:$K$148,N3)","v":0},null,null,"Toilet Servicing",{"$f":"COUNTIF(Spreadsheet!$K$286:$K$291,R3)","v":0},{"$f":"COUNTIF(Spreadsheet!$K$286:$K$291,S3)","v":0},{"$f":"COUNTIF(Spreadsheet!$K$286:$K$291,T3)","v":0},0,0,null,"Aircraft Turnaround Handling",{"$f":"COUNTIF(Spreadsheet!$K$368:$K$399,Y3)","v":0},{"$f":"COUNTIF(Spreadsheet!$K$368:$K$399,Z3)","v":0},{"$f":"COUNTIF(Spreadsheet!$K$368:$K$399,AA3)","v":0},{"$f":"COUNTIF(Settings!$C$106:$C$117,$AA$3)","v":0},0,null,"Load Control Task Job Responsibility",{"$f":"COUNTIF(Spreadsheet!$K$496,AF3)","v":0},{"$f":"COUNTIF(Spreadsheet!$K$496,AG3)","v":0},{"$f":"COUNTIF(Spreadsheet!$K$496,AH3)","v":0},null,null,"ReportingIncidents Accidents and NearMisses",{"$f":"COUNTIF(Spreadsheet!$K$522:$K$522,AL3)","v":0},{"$f":"COUNTIF(Spreadsheet!$K$522:$K$522,AM3)","v":0},{"$f":"COUNTIF(Spreadsheet!$K$522:$K$522,AN3)","v":0}]
[null,null,null,null,null,null,null,null,null,null,"Terminating Baggage",{"$f":"COUNTIF(Spreadsheet!$K$151:$K$156,L3)","v":0},{"$f":"COUNTIF(Spreadsheet!$K$151:$K$156,M3)","v":0},{"$f":"COUNTIF(Spreadsheet!$K$151:$K$156,N3)","v":0},null,null,"Portable Water Servicing",{"$f":"COUNTIF(Spreadsheet!$K$294:$K$302,R3)","v":0},{"$f":"COUNTIF(Spreadsheet!$K$294:$K$302,S3)","v":0},{"$f":"COUNTIF(Spreadsheet!$K$294:$K$302,T3)","v":0},0,0,null,"Aircraft Departure",{"$f":"COUNTIF(Spreadsheet!$K$402:$K$443,Y4)","v":0},{"$f":"COUNTIF(Spreadsheet!$K$402:$K$443,Z4)","v":0},{"$f":"COUNTIF(Spreadsheet!$K$402:$K$443,AA3)","v":0},{"$f":"COUNTIF(Settings!$C$118:$C$141,$AA$3)","v":0},0,null,"Qualification Requirements",{"$f":"COUNTIF(Spreadsheet!$K$499:$K$499,AF3)","v":0},{"$f":"COUNTIF(Spreadsheet!$K$499:$K$499,AG3)","v":0},{"$f":"COUNTIF(Spreadsheet!$K$499:$K$499,AH3)","v":0},null,null,"Airside Safety Investigation Procedure",{"$f":"COUNTIF(Spreadsheet!$K$525:$K$530,AL3)","v":0},{"$f":"COUNTIF(Spreadsheet!$K$525:$K$530,AM3)","v":0},{"$f":"COUNTIF(Spreadsheet!$K$525:$K$530,AN3)","v":0}]
[null,null,null,null,null,null,null,null,null,null,"Special Baggage",{"$f":"COUNTIF(Spreadsheet!$K$159:$K$164,L3)","v":0},{"$f":"COUNTIF(Spreadsheet!$K$159:$K$164,M3)","v":0},{"$f":"COUNTIF(Spreadsheet!$K$159:$K$164,N3)","v":0},null,null,"Aircraft Cleaning and Disinfection",{"$f":"COUNTIF(Spreadsheet!$K$305:$K$325,R3)","v":0},{"$f":"COUNTIF(Spreadsheet!$K$305:$K$323,S3)","v":0},{"$f":"COUNTIF(Spreadsheet!$K$305:$K$325,T3)","v":0},{"$f":"COUNTIF(Settings!C72:C91,T3)","v":0},0,null,"Open Ramp Departure",{"$f":"COUNTIF(Spreadsheet!$K$446:$K$446,Y3)","v":0},{"$f":"COUNTIF(Spreadsheet!$K$446:$K$446,Z3)","v":0},{"$f":"COUNTIF(Spreadsheet!$K$446:$K$446,AA3)","v":0},null,0,null,"Documentation",{"$f":"COUNTIF(Spreadsheet!$K$502:$K$502,AF3)","v":0},{"$f":"COUNTIF(Spreadsheet!$K$502:$K$502,AG3)","v":0},{"$f":"COUNTIF(Spreadsheet!$K$502:$K$502,AH3)","v":0},null,null,"Monitoring Procedures",{"$f":"COUNTIF(Spreadsheet!$K$533,AL3)","v":0},{"$f":"COUNTIF(Spreadsheet!$K$533,AM3)","v":0},{"$f":"COUNTIF(Spreadsheet!$K$533,AN3)","v":0}]
[null,null,null,null,null,null,null,null,null,null,"Disruption",{"$f":"COUNTIF(Spreadsheet!$K$167:$K$173,L3)","v":0},{"$f":"COUNTIF(Spreadsheet!$K$167:$K$173,M3)","v":0},{"$f":"COUNTIF(Spreadsheet!$K$167:$K$173,N3)","v":0},null,null,"Safety During Aircraft Deicing/Anti-icing Operations",{"$f":"COUNTIF(Spreadsheet!$K$328:$K$331,R3)","v":0},{"$f":"COUNTIF(Spreadsheet!$K$328:$K$331,S3)","v":0},{"$f":"COUNTIF(Spreadsheet!$K$328:$K$331,T3)","v":0},0,0,null,"Aircraft Powerback Operations",{"$f":"COUNTIF(Spreadsheet!$K$449:$K$449,Y3)","v":0},{"$f":"COUNTIF(Spreadsheet!$K$449:$K$449,Z3)","v":0},{"$f":"COUNTIF(Spreadsheet!$K$449:$K$449,AA3)","v":0},null,0,null,"Load Control Process Flow",{"$f":"COUNTIF(Spreadsheet!$K$505:$K$506,AF3)","v":0},{"$f":"COUNTIF(Spreadsheet!$K$505:$K$506,AG3)","v":0},{"$f":"COUNTIF(Spreadsheet!$K$505:$K$506,AH3)","v":0}]
[null,null,null,null,null,null,null,null,null,null,"Mishandled Baggage",{"$f":"COUNTIF(Spreadsheet!$K$176:$K$180,L3)","v":0},{"$f":"COUNTIF(Spreadsheet!$K$176:$K$180,M3)","v":0},{"$f":"COUNTIF(Spreadsheet!$K$176:$K$180,N3)","v":0},null,null,null,null,null,null,null,null,null,"Aircraft Towing",{"$f":"COUNTIF(Spreadsheet!$K$452:$K$467,Y3)","v":0},{"$f":"COUNTIF(Spreadsheet!$K$452:$K$467,Z3)","v":0},{"$f":"COUNTIF(Spreadsheet!$K$452:$K$467,AA3)","v":0},{"$f":"COUNTIF(Settings!$C$142:$C$152,$AA$3)","v":0},0]
[null,null,null,null,null,null,null,null,null,null,"Baggage Systems",{"$f":"COUNTIF(Spreadsheet!$K$183:$K$188,L3)","v":0},{"$f":"COUNTIF(Spreadsheet!$K$183:$K$188,M3)","v":0},{"$f":"COUNTIF(Spreadsheet!$K$183:$K$188,N3)","v":0},null,null,null,null,null,null,null,null,null,"LongTerm Parking for Aircraft",{"$f":"COUNTIF(Spreadsheet!$K$470:$K$471,Y3)","v":0},{"$f":"COUNTIF(Spreadsheet!$K$470:$K$471,Z3)","v":0},{"$f":"COUNTIF(Spreadsheet!$K$470:$K$471,AA3)","v":0},{"$f":"COUNTIF(Settings!$C$153:$C$154,$AA$3)","v":0},0]
[]
[]
[]
[]
[]
[]
[]
[]
[]
[]
[]
[]
[]
[]
[]
[]
[]
[]
[]
[]
[]
[]
[]
[null,null,null,null,null,null,null,null,null,null,null,null,null,null,null,null,"3. Aircraft General Safety/ Servicing Operations"]
[null,null,null,null,null,null,null,null,null,null,null,null,null,null,null,null,"Cargo/Mail Handling Procedures","Variation","Safety Critical Variation","Non Safety Critical Variation"]
[null,null,null,null,null,null,null,null,null,null,null,null,null,null,null,null,"Ramp Safety in Aircraft Handling",{"$f":"T4","v":0},{"$f":"U4","v":0},{"$f":"V4","v":0}]
[null,null,null,null,null,null,null,null,null,null,null,null,null,null,null,null,"Safety During Fueling/Defueling",{"$f":"T5","v":0},{"$f":"U5","v":0},{"$f":"V5","v":0},null,null,null,"4. Aircraft Handling Procedures"]
{"$rows_left_out":11}
{"sheet":"Settings","index":3,"n_rows":154,"n_cols":13,"rows_kept":154,"cut":false,"hidden":true,"merged":[]}
["Please do not make any changes to this sheet"]
[]
["Main Procedure","Sub - Procedure","Gap Analysis Airline GOM Vs IGOM"]
["3.1.2 General Ramp Safety","☛3.1.2.1 Engine Danger Area",{"$f":"VLOOKUP(B4,Spreadsheet!$I$17:$K$539,3,FALSE)","v":0},null,null,null,null,null,null,null,null,null,"3.4.1 Introduction"]
["3.1.3 Safety Instructions for Operating Ground Support Equipment (GSE) on the Ramp","☛3.1.3.1 General Safety Instructions",{"$f":"VLOOKUP(B5,Spreadsheet!$I$17:$K$539,3,FALSE)","v":0},null,null,null,null,null,null,null,null,null,"3.4.2 Conditions for Using Hand Signals"]
["3.1.3 Safety Instructions for Operating Ground Support Equipment (GSE) on the Ramp","☛3.1.3.2 Basic Operating Requirements for GSE",{"$f":"VLOOKUP(B6,Spreadsheet!$I$17:$K$539,3,FALSE)","v":{"$error":"#N/A"}},null,null,null,null,null,null,null,null,null,"3.4.3 Guide Person Hand Signals (for GSE)"]
["3.1.3 Safety Instructions for Operating Ground Support Equipment (GSE) on the Ramp","☛3.1.3.4 Ground Support Equipment Safety Driving and Parking Inside Equipment Restraint Area",{"$f":"VLOOKUP(B7,Spreadsheet!$I$17:$K$539,3,FALSE)","v":0},null,null,null,null,null,null,null,null,null,"3.4.4 Aircraft Movement Hand Signals – Headset Operator to Tug Driver"]
["3.1.3 Safety Instructions for Operating Ground Support Equipment (GSE) on the Ramp","☛3.1.3.6 Passenger Stairs",{"$f":"VLOOKUP(B8,Spreadsheet!$I$17:$K$539,3,FALSE)","v":0},null,null,null,null,null,null,null,null,null,"3.4.5 Aircraft Movement Hand Signal – Wingwalker to Headset Operator/Tug Driver,Marshaller,Flight Crew"]
["3.1.3 Safety Instructions for Operating Ground Support Equipment (GSE) on the Ramp","☛3.1.3.7 Belt Loader",{"$f":"VLOOKUP(B9,Spreadsheet!$I$17:$K$539,3,FALSE)","v":0},null,null,null,null,null,null,null,null,null,"3.4.6 Marshalling Hand Signals (for aircraft)"]
["3.1.3 Safety Instructions for Operating Ground Support Equipment (GSE) on the Ramp","☛3.1.3.8 Unit Load Device Loader",{"$f":"VLOOKUP(B10,Spreadsheet!$I$17:$K$539,3,FALSE)","v":0},null,null,null,null,null,null,null,null,null,"3.4.7 Technical/Servicing Hand Signals-Ground Staff to Flight Crew"]
["3.1.3 Safety Instructions for Operating Ground Support Equipment (GSE) on the Ramp","☛3.1.3.9 Elevating Equipment",{"$f":"VLOOKUP(B11,Spreadsheet!$I$17:$K$539,3,FALSE)","v":0},null,null,null,null,null,null,null,null,null,"3.4.8 Technical/Servicing Hand Signals-Flight Crew to Ground Staff"]
["3.1.3 Safety Instructions for Operating Ground Support Equipment (GSE) on the Ramp","☛3.1.3.10 Tractors/Electric Baggage Tag ",{"$f":"VLOOKUP(B12,Spreadsheet!$I$17:$K$539,3,FALSE)","v":{"$error":"#N/A"}},null,null,null,null,null,null,null,null,null,"4.2.1 Wheel Chock Placement"]
["☛3.3.5 High Winds Activity Table",null,{"$f":"VLOOKUP(A13,Spreadsheet!$H$17:$K$539,4,FALSE)","v":0},null,null,null,null,null,null,null,null,null,"4.2.2 Chock Placement Diagrams"]
["☛3.4.2 General Conditions for Using Hand Signals",null,{"$f":"VLOOKUP(A14,Spreadsheet!$H$17:$K$539,4,FALSE)","v":0},null,null,null,null,null,null,null,null,null,"4.2.3 Regional Aircraft Chocking"]
["☛3.4.3 Specific Requirements for Using Marshalling Hand Signals",null,{"$f":"VLOOKUP(A15,Spreadsheet!$H$17:$K$539,4,FALSE)","v":0},null,null,null,null,null,null,null,null,null,"☞4.5.1 Supervision of Aircraft Turnaround Handling"]
["☛3.4.4    Guide Person Hand Signals for Ground Support Equipment","☛3.4.4.1 To Attract the Operator's Attention and Take Command",{"$f":"VLOOKUP(B16,Spreadsheet!$I$17:$K$539,3,FALSE)","v":0},null,null,null,null,null,null,null,null,null,"☞4.5.6 Loading"]
["☛3.4.4    Guide Person Hand Signals for Ground Support Equipment","☛3.4.4.2 Forward Movement",{"$f":"VLOOKUP(B17,Spreadsheet!$I$17:$K$539,3,FALSE)","v":0},null,null,null,null,null,null,null,null,null,"☞4.5.7 Securing of Load"]
["☛3.4.4    Guide Person Hand Signals for Ground Support Equipment","☛3.4.4.3 Backward Movement:",{"$f":"VLOOKUP(B18,Spreadsheet!$I$17:$K$539,3,FALSE)","v":0}]
["☛3.4.4    Guide Person Hand Signals for Ground Support Equipment","☛3.4.4.4 Turn Right (from the driver's point of view)",{"$f":"VLOOKUP(B19,Spreadsheet!$I$17:$K$539,3,FALSE)","v":0}]
["☛3.4.4    Guide Person Hand Signals for Ground Support Equipment","☛3.4.4.5 Turn Left (from the driver's point of view)",{"$f":"VLOOKUP(B20,Spreadsheet!$I$17:$K$539,3,FALSE)","v":0}]
["☛3.4.4    Guide Person Hand Signals for Ground Support Equipment","☛3.4.4.6 Lift",{"$f":"VLOOKUP(B21,Spreadsheet!$I$17:$K$539,3,FALSE)","v":0}]
["☛3.4.4    Guide Person Hand Signals for Ground Support Equipment","☛3.4.4.7 Lower",{"$f":"VLOOKUP(B22,Spreadsheet!$I$17:$K$539,3,FALSE)","v":0}]
["☛3.4.4    Guide Person Hand Signals for Ground Support Equipment","☛3.4.4.8 Accompanied Movement",{"$f":"VLOOKUP(B23,Spreadsheet!$I$17:$K$539,3,FALSE)","v":0}]
["☛3.4.4    Guide Person Hand Signals for Ground Support Equipment","☛3.4.4.9 Indicate Distance",{"$f":"VLOOKUP(B24,Spreadsheet!$I$17:$K$539,3,FALSE)","v":0}]
["☛3.4.4    Guide Person Hand Signals for Ground Support Equipment","☛3.4.4.10 Stop",{"$f":"VLOOKUP(B25,Spreadsheet!$I$17:$K$539,3,FALSE)","v":0}]
["☛3.4.4    Guide Person Hand Signals for Ground Support Equipment","☛3.4.4.11 OK",{"$f":"VLOOKUP(B26,Spreadsheet!$I$17:$K$539,3,FALSE)","v":0}]
["☛3.4.4    Guide Person Hand Signals for Ground Support Equipment","☛3.4.4.12 Chocks Inserted; Stabilizers On",{"$f":"VLOOKUP(B27,Spreadsheet!$I$17:$K$539,3,FALSE)","v":0}]
["☛3.4.4    Guide Person Hand Signals for Ground Support Equipment","☛3.4.4.13 Chocks Removed; Stabilizers Off",{"$f":"VLOOKUP(B28,Spreadsheet!$I$17:$K$539,3,FALSE)","v":0}]
["☛3.4.4    Guide Person Hand Signals for Ground Support Equipment","☛3.4.4.14 To Interrupt Power Source (electricity, fuel, air)",{"$f":"VLOOKUP(B29,Spreadsheet!$I$17:$K$539,3,FALSE)","v":0}]
["☛3.4.4    Guide Person Hand Signals for Ground Support Equipment","☛3.4.4.15 Stop Engine",{"$f":"VLOOKUP(B30,Spreadsheet!$I$17:$K$539,3,FALSE)","v":0}]
["☛3.4.4    Guide Person Hand Signals for Ground Support Equipment","☛3.4.4.16 To Connect or Disconnect",{"$f":"VLOOKUP(B31,Spreadsheet!$I$17:$K$539,3,FALSE)","v":0}]
["☛3.4.4    Guide Person Hand Signals for Ground Support Equipment","☛3.4.4.17 Brakes On/Off",{"$f":"VLOOKUP(B32,Spreadsheet!$I$17:$K$539,3,FALSE)","v":0}]
["☛3.4.5 Aircraft Movement Hand Signal – Wingwalker to Headset Operator/Tug Driver,Marshaller,Flight Crew","☛3.4.5.1 Vehicle Brakes Off",{"$f":"VLOOKUP(B33,Spreadsheet!$I$17:$K$539,3,FALSE)","v":0}]
["☛3.4.5 Aircraft Movement Hand Signal – Wingwalker to Headset Operator/Tug Driver,Marshaller,Flight Crew","☛3.4.5.2 Clear to Push",{"$f":"VLOOKUP(B34,Spreadsheet!$I$17:$K$539,3,FALSE)","v":0}]
["☛3.4.5 Aircraft Movement Hand Signal – Wingwalker to Headset Operator/Tug Driver,Marshaller,Flight Crew","☛3.4.5.3 Negative/Hold",{"$f":"VLOOKUP(B35,Spreadsheet!$I$17:$K$539,3,FALSE)","v":0}]
["☛3.4.5 Aircraft Movement Hand Signal – Wingwalker to Headset Operator/Tug Driver,Marshaller,Flight Crew","☛3.4.5.4 Vehicle Brakes On/Stop",{"$f":"VLOOKUP(B36,Spreadsheet!$I$17:$K$539,3,FALSE)","v":0}]
["☛3.4.5 Aircraft Movement Hand Signal – Wingwalker to Headset Operator/Tug Driver,Marshaller,Flight Crew","☛3.4.5.5 Slow Down",{"$f":"VLOOKUP(B37,Spreadsheet!$I$17:$K$539,3,FALSE)","v":0}]
["☛3.4.5 Aircraft Movement Hand Signal – Wingwalker to Headset Operator/Tug Driver,Marshaller,Flight Crew","☛3.4.5.6 Change of Pushback Direction",{"$f":"VLOOKUP(B38,Spreadsheet!$I$17:$K$539,3,FALSE)","v":0}]
["☛3.4.6    Aircraft Movement Hand Signals–Wingwalker to Headset Operator/Tug Driver, Marshaller, Flight Crew (as applicable)","☛3.4.6.1 Clear to Move Aircraft",{"$f":"VLOOKUP(B39,Spreadsheet!$I$17:$K$539,3,FALSE)","v":0}]
["☛3.4.6    Aircraft Movement Hand Signals–Wingwalker to Headset Operator/Tug Driver, Marshaller, Flight Crew (as applicable)","☛3.4.6.2 Stop Movement of Aircraft",{"$f":"VLOOKUP(B40,Spreadsheet!$I$17:$K$539,3,FALSE)","v":0}]
{"$rows_left_out":115}
{"sheet":"Dashboard","index":4,"n_rows":57,"n_cols":5,"rows_kept":57,"cut":false,"hidden":false,"merged":[]}
[]
[]
[]
[]
[]
[]
[]
[]
[]
[]
[]
[]
[]
[]
[]
[]
[]
[]
[]
[]
[]
[]
[]
[]
[]
[]
[]
[]
[]
[]
[]
[]
[]
[]
[]
[]
[]
[]
[]
[]
{"$rows_left_out":17}